Ethnicity,Education,background,Household_Income,Household_decision,Age_Maternalnew,LiveBirths,StillBirths,Fights_inlaws,Child_death,Miscarriage,Relationship_prob,Long_illness,other,Anxiety,Depression,AnxietyTri,DepressionTrie,AnxietyDi,DepressionDi,Social_Support,Statement1,Statement2,Statement3,Statement4,Statement5,Statement6,Statement7,Statement8,Statement9,Statement10,Statement11,Statement12,Statement13,Statement14,Stat1,Stat2,Stat3,Stat4,Stat5,Stat6,Stat7,Stat8,Stat9,Stat10,Stat11,Stat12,Stat13,Stat14,Stat15,Stat16,Stat17,Stat18,Stat19,Stat20,Stat21,Stat22,Stat23,Stat24,Age2,Age3,Age4,Age5,Age6,Age7,Second_child,child3,child4,child5,Child6,child7,Age1,Maternal_age,Total_svd,total_epiziotomies,Total_deliveries,Total_Csection,Mode_delive1,Mode_delive2,Mode_delive3,Mode_delive4,Mode_delive5,Mode_delive6,Mode_delive7,children_dichot,LOGFEMALE,SQFemale,S2Female,inverseFemale,femaledichot,femaledichot1,depressionSQ,logdepression,femaledicot4,maledichot2,VAR00002,VAR00001,Attachment,Social_integration,Reassurance,Reliable_alliance,Guidance,Nurturance,Edu_dichot,background_dichot,income_di,Female_dichot,Female_total,Male_dichot,Male_total,People_living,Csectiondichot,episiotomy_dichot,Pregnancy,Menstrual_history,Used_Plannig,First_child,Duration_Marriage,Age,Smoking,Substance_abuse,Adverse_outcomes,Abortion,Past_Psych,Family_psych,PArent_death,Husband_Death,Harrasment,Domestc_violence,Children_total,Occupation
1,4,2,1,3,20,1,0,0,0,0,0,0,0,5,2,0,0,0,0,96,0,1,1,0,0,0,0,1,1,0,2,0,1,0,4,4,4,4,4,4,4,4,4,4,4,4,4,4,4,4,4,4,4,4,4,4,4,4, , , , , , , , , , , , ,2,20,0,1,1,0,1, , , , , , ,1,0,1,0,-1,0,0,1.4142135623731,.301029995663981,0,0, , ,16,16,16,16,16,16,2,2,1,0,0,1,1,2,0,1,2,3,2,1,3,22,0,0,0,0,0,0,0,0,0,0,1,1
1,1,3,2,2,29,6,0,0,0,0,0,0,0,3,5,0,0,0,0,58,0,1,0,0,0,0,0,1,0,0,3,0,0,3,1,3,1,3,3,3,3,3,3,2,2,2,3,2,3,2,2,2,2,3,2,3,2,3,15,13,12,9,6, ,1,2,2,2,2, ,16,29,6,0,6,0,2,2,2,2,2,2, ,1,.698970004336019,2.23606797749979,16,-.2,1,1,2.23606797749979,.698970004336019,1,1, , ,9,11,12,7,7,12,1,2,2,1,4,1,2,2,0,0,2,1,2,1,16,45,0,0,0,0,0,0,1,0,0,0,6,1
2,5,1,1,4,20,6,1,0,0,0,0,0,0,12,13,2,2,1,1,62,1,1,2,1,1,3,2,2,2,2,3,3,1,1,2,3,3,2,3,3,3,3,3,4,3,2,2,3,2,3,3,3,2,4,1,1,3,1,14,10,8,6,2, ,2,2,1,2,2, ,17,20,4,2,6,0,2,2,2,2,1,1, ,1,.778151250383644,2.44948974278318,25,-.166666666666667,1,1,3.60555127546399,1.11394335230684,1,0, , ,10,10,12,12,10,8,2,1,1,1,5,1,1,1,0,1,2,1,2,2,18,37,0,0,1,0,0,0,0,0,1,0,6,1
1,1,2,1,2,23,6,0,0,0,0,0,0,0,8,4,1,0,1,0,68,1,1,1,1,2,0,2,1,0,0,2,0,0,1,3,2,2,3,3,3,3,3,2,3,3,3,3,3,3,3,3,3,2,3,3,3,3,3,11,9,6,5,2, ,2,2,2,1,1, ,12,20,5,0,6,1,2,2,2,2,3,2, ,1,.698970004336019,2.23606797749979,16,-.2,1,1,2,.602059991327962,1,1, , ,11,12,11,12,10,12,1,2,1,1,4,1,2,2,1,0,2,1,2,2,13,35,0,0,0,0,0,0,0,0,0,0,6,1
1,4,2,2,4,25,5,0,0,0,1,0,0,0,4,1,0,0,0,0,53,0,0,0,0,1,0,0,1,0,0,3,0,0,0,1,2,2,4,1,2,4,1,2,2,2,2,4,2,3,2,2,2,2,2,2,2,2,3,6,5,4,3, , ,2,1,2,1, , ,7,25,5,0,5,0,2,2,2,2,2, , ,1,.477121254719662,1.73205080756888,4,-.333333333333333,0,0,1,0,1,1, , ,8,6,10,7,8,14,2,2,2,1,2,1,3,2,0,0,1,1,2,1,7,32,0,0,1,0,0,0,1,0,0,0,5,1
4,2,2,2,3,22,4,1,0,0,1,1,0,0,9,7,1,0,1,0,65,1,1,3,0,2,0,0,3,0,3,2,0,1,0,3,2,3,2,3,2,2,3,2,3,3,3,3,3,2,3,3,3,3,3,3,3,3,2,8,6,2.5, , , ,2,1,2,2, , ,10,21,5,0,5,0,2,2,2,2,2, , ,1,.602059991327962,2,9,-.25,0,1,2.64575131106459,.845098040014257,1,1, , ,11,12,10,12,12,8,2,2,2,1,3,1,2,2,0,0,2,1,2,1,12,32,0,0,0,0,0,0,0,0,0,0,5,1
1,1,3,2,4,30,5,0,0,0,1,0,0,0,8,4,1,0,1,0,94,1,1,3,0,2,0,0,0,1,3,0,0,1,0,4,4,4,4,4,4,4,4,4,4,4,4,4,4,4,4,4,4,4,4,3,4,4,3,7,3,2,1, , ,2,2,1,2, , ,10,20,5,0,5,0,2,2,2,2,2, , ,1,.698970004336019,2.23606797749979,16,-.2,1,1,2,.602059991327962,1,0, , ,15,16,16,16,16,15,1,2,2,1,4,1,1,1,0,0,1,1,2,2,20,40,0,0,1,0,0,0,1,0,0,0,5,1
1,1,3,2,3,23,5,0,0,0,0,0,0,0,13,10,2,1,1,1,59,1,2,2,0,1,2,2,1,3,1,2,2,2,2,2,2,4,2,3,2,4,2,3,2,2,2,3,1,2,2,2,4,4,2,1,3,2,3,10,7,5,2, , ,1,2,2,2, , ,13,23,4,0,5,1,2,2,2,2,3, , ,1,.602059991327962,2,9,-.25,0,1,3.16227766016838,1,1,1, , ,7,9,10,10,12,11,1,2,2,1,3,1,2,2,1,0,2,1,2,1,15,36,0,0,1,1,0,0,0,0,0,0,5,1
1,3,2,2,4,20,4,1,0,0,0,0,0,0,13,14,2,2,1,1,61,2,2,3,1,1,3,1,3,3,1,2,2,1,2,3,3,4,2,2,2,3,2,3,3,3,3,2,2,3,2,3,1,3,2,3,2,3,2,10,7,3, , , ,2,1,1, , , ,13,20,4,0,4,0,2,2,2,2, , , ,1,.301029995663981,1.4142135623731,1,-.5,0,0,3.74165738677394,1.14612803567824,0,1, , ,12,8,9,10,12,10,2,2,2,1,1,1,3,2,0,0,2,1,2,1,14,33,1,0,0,0,0,0,1,0,0,0,4,1
1,1,1,2,2,28,4,0,0,0,0,0,0,0,7,6,0,0,0,0,82,1,1,2,0,0,0,0,2,1,0,3,0,0,3,3,4,4,3,3,4,3,3,4,4,3,3,3,4,4,3,3,4,4,3,3,4,3,3,4,3,2, , , ,1,1,1, , , ,7,28,3,1,4,0,1,2,2,2, , , ,1,.301029995663981,1.4142135623731,1,-.5,0,0,2.44948974278318,.778151250383644,0,1, , ,13,14,14,14,14,13,1,1,2,1,1,1,3,2,0,1,2,1,2,2,8,35,0,0,0,0,0,0,1,0,0,0,4,1
1,1,3,1,4,20,4,0,0,0,0,0,0,0,6,10,0,1,0,1,60,0,0,1,3,1,1,1,0,1,3,1,0,1,3,3,3,3,1,4,1,1,4,1,3,3,3,1,3,1,3,4,3,3,1,3,3,3,2,15,12,10, , , ,1,1,2, , , ,20,20,4,0,4,0,2,2,2,2, , , ,1,.477121254719662,1.73205080756888,4,-.333333333333333,0,0,3.16227766016838,1,1,1, , ,13,14,4,12,12,5,1,2,1,1,2,1,2,2,0,0,2,1,2,2,20,40,0,0,0,0,0,0,0,0,0,0,4,1
1,2,2,2,1,26,4, ,1,0,0,0,0,0,5,8,0,1,0,1,84,0,1,0,1,0,1,2,0,2,0,1,2,0,3,4,4,4,3,4,4,3,3,4,4,4,3,2,4,4,2,3,4,4,3,3,4,3,4,8,7,3, , , ,2,2,1, , , ,10, ,4,0,4,0,2,2,2,2, , , ,1,.602059991327962,2,9,-.25,0,1,2.82842712474619,.903089986991944,1,0, , ,14,15,13,15,13,14,2,2,2,1,3,1,1,2,0,0,1,1,2,2,16,36,0,0,0,0,0,0,0,0,0,0,4,1
1,2,2,2,1,25,4,1,0,0,0,0,0,0,5,6,0,0,0,0,86,0,2,0,1,0,1,1,1,1,0,1,1,2,0,4,3,3,3,3,3,4,3,4,4,3,4,3,4,4,3,4,4,4,3,4,4,4,4,13,6,4, , , ,2,2,2, , , ,15, ,4,0,4,0,2,2,2,2, , , ,1,.698970004336019,2.23606797749979,16,-.2,1,1,2.44948974278318,.778151250383644,1,0, , ,14,14,13,16,14,15,2,2,2,1,4,0,0,2,0,0,2,1,2,2,19,40,0,0,1,0,0,0,0,0,0,0,4,1
2,2,1,1,2,21,4,0,0,0,1,0,0,0,11,12,2,2,1,1,63,1,2,2,2,2,2,1,2,2,1,2,1,1,2,3,2,3,3,2,3,2,2,3,3,3,2,2,2,3,3,1,4,2,2,3,4,2,4,11,7,4, , , ,2,2,2, , , ,11,21,3,1,4,0,2,2,2,1, , , ,1,.698970004336019,2.23606797749979,16,-.2,1,1,3.46410161513775,1.07918124604762,1,0, , ,9,10,10,12,10,12,2,1,1,1,4,0,0,2,0,1,1,1,2,2,14,32,0,0,1,0,0,0,1,0,1,0,4,1
1,4,3,2,4,22,4,0,0,0,0,0,0,0,10,3,1,0,1,0,71,0,2,2,0,2,0,1,0,2,1,2,0,1,0,3,4,3,4,2,3,3,2,3,3,3,3,3,3,3,3,3,3,3,3,3,2,3,3,10,8,5, , , ,1,2,1, , , ,12,22,1,2,4,1,3,1,1,2, , , ,1,.477121254719662,1.73205080756888,4,-.333333333333333,0,0,1.73205080756888,.477121254719662,1,1, , ,13,9,12,12,12,13,2,2,2,1,2,1,2,2,1,1,2,1,2,2,14,34,0,0,0,0,0,0,0,0,0,0,4,1
2,1,3,1,4,24,4,0,0,0,1,0,0,0,13,14,2,2,1,1,63,2,2,1,1,2,3,1,2,2,2,3,2,2,2,2,2,4,3,3,3,3,3,2,2,3,2,1,3,4,2,1,3,4,1,3,3,3,3,7,3,1, , , ,1,1,2, , , ,10,24,2,1,4,1,2,2,1,3, , , ,1,.477121254719662,1.73205080756888,4,-.333333333333333,0,0,3.74165738677394,1.14612803567824,1,1, , ,9,12,7,10,12,13,1,2,1,1,2,1,2,2,1,1,2,1,2,2,11,34,0,0,0,1,0,1,0,0,0,0,4,1
2,1,1,2,3,21,4,2,0,0,0,0,1,0,13,11,2,2,1,1,62,1,2,3,0,1,3,2,1,2,1,2,2,2,2,3,2,4,2,2,2,4,2,3,3,3,2,1,4,3,2,3,1,2,3,3,3,2,3,13,10,5, , , ,2,2,1, , , ,14,21,2,0,4,2,2,2,3,3, , , ,1,.602059991327962,2,9,-.25,0,1,3.3166247903554,1.04139268515823,1,0, , ,11,11,9,9,10,12,1,1,2,1,3,1,1,2,1,0,2,1,2,2,16,35,0,0,0,0,0,0,1,0,0,0,4,1
1,5,1,1,2,23,4,2,1,0,1,0,0,0,12,9,2,1,1,1,56,1,2,3,1,2,3,2,1,2,1,1,1,1,0,3,3,4,2,2,2,2,2,2,2,3,2,2,1,3,1,1,3,2,3,3,2,2,4,10,6,3, , , ,2,2,1, , , ,14,23,2,0,4,2,2,2,3,3, , , ,1,.602059991327962,2,9,-.25,0,1,3,.954242509439325,1,0, , ,10,7,9,10,9,11,2,1,1,1,3,1,1,1,1,0,2,1,2,2,17,37,0,0,0,0,0,0,1,0,0,0,4,1
1,5,1,2,2,23,4,1,0,0,0,0,0,0,13,11,2,2,1,1,57,2,1,2,1,3,3,2,1,2,1,1,2,1,2,3,2,4,2,2,3,2,2,2,2,3,1,3,2,3,2,2,3,2,3,4,1,1,3,11,6,4, , , ,2,2,2, , , ,14,23,0,2,4,2,1,1,3,3, , , ,1,.698970004336019,2.23606797749979,16,-.2,1,1,3.3166247903554,1.04139268515823,1,0, , ,11,7,11,9,9,10,2,1,2,1,4,0,0,2,1,1,2,1,2,2,16,37,0,0,0,0,0,0,1,0,0,0,4,1
1,3,3,1,3,20,3,0,0,0,1,0,0,1,1,5,0,0,0,0,71,0,0,0,0,0,0,0,0,1,1,0,3,0,1,4,3,3,1,3,3,2,4,3,3,3,3,4,3,2,3,3,3,3,3,3,3,3,3,16,13, , , , ,1,1, , , , ,17,20,3,0,3,0,2,2,2, , , , ,1,0,1,0,-1,0,0,2.23606797749979,.698970004336019,0,1, , ,12,13,13,13,12,8,2,2,1,0,0,1,3,2,0,0,2,1,2,1,18,37,0,0,0,0,0,0,1,0,0,0,3,1
1,4,2,1,3,22,2,1,0,1,1,0,0,0,14,9,2,1,1,1,66,3,1,3,1,2,0,0,2,2,2,2,1,2,2,3,3,3,2,2,3,3,2,3,1,3,3,3,3,2,3,3,3,3,3,3,3,3,3,.1,0, , , , ,1,1, , , , ,13,23,3,0,3,0,2,2,2, , , , ,1,0,1,0,-1,0,0,3,.954242509439325,0,1, , ,12,10,12,10,12,10,2,2,1,0,0,1,3,2,0,0,2,1,2,1,14,35,0,0,0,0,0,0,1,0,0,0,3,1
2,1,1,2,2,23,3,1,0,0,0,0,0,0,15,12,2,2,1,1,59,2,1,3,2,1,3,2,2,3,1,2,1,2,2,2,2,3,2,2,3,3,4,2,2,3,2,2,4,3,1,2,2,3,2,2,3,2,3,6,2, , , , ,1,2, , , , ,9,23,3,0,3,0,2,2,2, , , , ,1,.301029995663981,1.4142135623731,1,-.5,0,0,3.46410161513775,1.07918124604762,0,1, , ,9,13,9,8,9,11,1,1,2,1,1,1,2,2,0,0,2,1,2,1,11,32,0,0,0,0,0,0,0,0,0,0,3,2
3,4,3,2,3,21,3,1,0,0,0,0,0,0,9,5,1,0,1,0,87,2,1,3,1,1,1,0,1,1,0,1,1,1,0,4,4,4,3,4,4,4,4,4,4,4,4,1,3,4,3,3,3,3,4,4,4,4,4,7,5, , , , ,1,2, , , , ,9, ,3,0,3,0,2,2,2, , , , ,1,.301029995663981,1.4142135623731,1,-.5,0,0,2.23606797749979,.698970004336019,0,1, , ,15,15,13,15,14,15,2,2,2,1,1,1,2,2,0,0,2,1,2,1,10,30,0,0,0,1,0,0,1,0,0,0,3,1
1,2,3,3,2,28,3, ,0,0,0,0,0,0,5,2,0,0,0,0,88,1,1,0,0,0,0,1,1,1,0,1,0,1,0,4,4,3,3,3,3,4,4,3,4,3,4,4,4,4,4,4,4,4,3,3,4,4,4,8,6, , , , ,1,2, , , , ,10, ,3,0,3,0,2,2,2, , , , ,1,.301029995663981,1.4142135623731,1,-.5,0,0,1.4142135623731,.301029995663981,0,1, , ,14,15,13,16,15,15,2,2,2,1,1,1,2,2,0,0,2,1,2,1,12,38,0,0,0,0,0,0,1,0,0,0,3,1
1,2,1,1,2,29,3,0,0,0,0,0,0,0,2,11,0,2,0,1,75,0,0,0,0,1,0,0,2,1,3,1,3,0,3,4,3,4,1,3,3,2,4,3,3,4,4,3,3,2,4,4,3,3,3,3,3,3,3,5,2, , , , ,1,1, , , , ,6,29,2,1,3,0,1,2,2, , , , ,1,.301029995663981,1.4142135623731,1,-.5,0,0,3.3166247903554,1.04139268515823,0,1, , ,14,13,12,13,15,8,2,1,1,1,1,1,2,1,0,1,2,2,2,2,8,35,0,0,0,0,0,0,1,0,0,0,3,1
2,1,1,2,2,22,3,0,0,0,0,1,0,0,9,10,1,1,1,1,64,1,1,1,2,1,3,0,2,3,1,2,0,1,1,3,2,4,2,2,3,2,3,3,2,4,3,3,3,4,1,1,3,3,2,3,2,2,4,6,2, , , , ,1,2, , , , ,12,22,3,0,3,0,2,2,2, , , , ,1,.477121254719662,1.73205080756888,4,-.333333333333333,0,0,3.16227766016838,1,1,0, , ,10,10,11,10,11,12,1,1,2,1,2,1,1,2,0,0,2,1,2,2,15,34,0,0,0,0,0,0,0,0,0,0,3,2
1,2,3,2,4,19,3,0,0,0,0,0,0,0,2,3,0,0,0,0,52,1,0,0,0,0,0,0,1,0,2,1,0,0,0,1,2,2,3,1,2,4,1,2,2,2,2,4,2,3,2,2,2,2,2,2,2,2,3,5,3, , , , ,2,2, , , , ,9,19,0,3,3,0,1,1,1, , , , ,1,.477121254719662,1.73205080756888,4,-.333333333333333,0,0,1.73205080756888,.477121254719662,1,0, , ,8,6,10,7,8,13,2,2,2,1,2,1,1,2,0,1,2,2,2,1,9,28,0,0,0,0,0,0,0,0,0,0,3,1
1,4,1,2,2,22,3,0,0,0,0,0,0,0,11,11,2,2,1,1,59,1,2,2,2,1,3,1,1,2,2,2,0,2,1,3,3,3,3,1,2,3,4,2,2,3,2,2,2,3,2,1,1,3,2,3,2,3,4,8,2, , , , ,2,2, , , , ,12,22,1,2,3,0,2,1,1, , , , ,1,.477121254719662,1.73205080756888,4,-.333333333333333,0,0,3.3166247903554,1.04139268515823,1,0, , ,10,9,8,9,10,13,2,1,2,1,2,1,1,2,0,1,2,1,2,1,15,34,0,0,0,0,0,0,0,0,0,0,3,1
1,3,3,1,3,22,3,0,0,0,0,0,1,0,6,11,0,2,0,1,67,0,1,1,2,1,0,0,2,1,1,2,2,1,3,3,2,3,2,2,3,2,2,3,3,3,3,3,3,3,3,3,3,3,3,3,3,3,3,4,3, , , , ,2,1, , , , ,8,22,3,0,3,0,2,2,2, , , , ,1,.477121254719662,1.73205080756888,4,-.333333333333333,0,0,3.3166247903554,1.04139268515823,1,0, , ,11,10,12,12,12,10,2,2,1,1,2,1,1,2,0,0,2,1,2,2,9,30,0,0,0,0,0,0,0,0,0,0,3,1
1,4,2,2,2,24.9,1,2,1,1,1,0,1,0,17,9,2,1,1,1,77,3,2,3,0,3,3,3,1,1,2,2,1,2,0,1,4,4,4,4,1,3,3,1,4,4,4,4,3,3,3,3,3,3,4,4,3,3,4,0,0, , , , ,2,1, , , , ,.1,19,3,0,3,0,2,2,2, , , , ,1,.477121254719662,1.73205080756888,4,-.333333333333333,0,0,3,.954242509439325,1,0, , ,15,13,10,11,14,14,2,2,2,1,2,1,1,2,0,0,1,1,2,2,6,25,0,0,0,0,0,0,0,0,0,0,3,1
1,4,2,2,2,25,3,1,0,0,1,0,0,0,6,3,0,0,0,0,89,1,1,0,0,1,0,3,1,0,1,0,0,1,0,4,4,4,4,3,4,4,4,4,4,3,1,4,4,4,4,4,4,4,4,4,4,4,2,5,3, , , , ,2,2, , , , ,8, ,2,1,3,0,1,2,2, , , , ,1,.477121254719662,1.73205080756888,4,-.333333333333333,0,0,1.73205080756888,.477121254719662,1,0, , ,15,15,16,16,13,14,2,2,2,1,2,1,1,2,0,1,1,1,2,1,9,33,0,0,0,1,0,0,1,0,0,0,3,1
1,1,3,2,1,31,3,0,1,0,1,0,1,1,11,6,2,0,1,0,96,1,3,3,0,1,0,1,1,2,1,2,0,1,1,4,4,4,4,4,4,4,4,4,4,4,4,4,4,4,4,4,4,4,4,4,4,4,4,9,5, , , , ,2,1, , , , ,11,29,3,0,3,0,2,2,2, , , , ,1,.477121254719662,1.73205080756888,4,-.333333333333333,0,0,2.44948974278318,.778151250383644,1,0, , ,16,16,16,16,16,16,1,2,2,1,2,1,1,2,0,0,1,1,2,2,13,42,0,0,1,0,0,0,0,0,0,0,3,1
1,1,2,1,2,15,3,0,1,1,0,1,1,0,11,8,2,1,1,1,60,1,1,2,0,2,1,2,2,1,1,1,1,2,2,2,2,2,2,2,3,3,2,2,3,2,3,3,3,3,3,3,3,3,3,2,2,2,2,18,1, , , , ,2,1, , , , ,20,17,3,0,3,0,2,2,2, , , , ,1,.477121254719662,1.73205080756888,4,-.333333333333333,0,0,2.82842712474619,.903089986991944,1,0, , ,9,9,11,10,11,10,1,2,1,1,2,1,1,1,0,0,2,1,2,2,25,35,0,0,0,0,0,0,1,0,0,0,3,1
1,4,2,2,1,18,3,0,1,0,1,1,0,0,8,1,1,0,1,0,74,1,0,2,0,3,1,0,0,0,0,2,0,0,0,3,2,4,3,1,4,3,1,4,4,3,3,3,4,4,3,3,4,4,1,4,4,3,2,7,5, , , , ,2,1, , , , ,12,15,3,0,3,0,2,2,2, , , , ,1,.477121254719662,1.73205080756888,4,-.333333333333333,0,0,1,0,1,0, , ,12,10,12,14,14,12,2,2,2,1,2,1,1,1,0,0,2,1,2,2,14,30,0,0,0,0,0,0,0,0,0,0,3,1
1,2,3,2,4,19,3,0,0,0,0,0,0,0,2,3,0,0,0,0,52,1,0,0,0,0,0,0,1,0,2,1,0,0,0,1,2,2,3,1,2,4,1,2,2,2,2,4,2,3,2,2,2,2,2,2,2,2,3,5,3, , , , ,2,2, , , , ,9,19,0,3,3,0,1,1,1, , , , ,1,.477121254719662,1.73205080756888,4,-.333333333333333,0,0,1.73205080756888,.477121254719662,1,0, , ,8,6,10,7,8,13,2,2,2,1,2,1,1,1,0,1,2,2,2,1,9,28,0,0,0,0,0,1,0,0,0,0,3,1
1,4,2,2,2,21,3,1,0,0,1,0,1,0,8,8,1,1,1,1,86,1,1,1,1,1,2,2,1,1,1,1,1,1,1,4,3,4,3,4,4,4,4,4,3,3,4,3,4,4,2,3,4,3,4,4,4,4,3,4,2, , , , ,1,2, , , , ,5, ,3,0,3,0,2,2,2, , , , ,1,.477121254719662,1.73205080756888,4,-.333333333333333,0,0,2.82842712474619,.903089986991944,1,0, , ,13,16,15,15,13,14,2,2,2,1,2,1,1,1,0,0,2,1,2,2,6,26,0,0,0,1,0,0,0,0,0,0,3,1
1,1,1,3,2,23,3,1,1,0,0,0,0,0,15,15,2,2,1,1,59,2,2,2,1,2,3,1,3,3,3,3,1,2,2,3,3,4,2,2,2,2,2,2,3,3,2,2,2,2,4,2,3,2,1,3,3,1,4,5,3, , , , ,2,2, , , , ,9,23,1,2,3,0,2,1,1, , , , ,1,.602059991327962,2,9,-.25,0,1,3.87298334620742,1.17609125905568,1,0, , ,11,9,7,10,12,10,1,1,2,1,3,0,0,2,0,1,2,1,2,2,12,32,0,0,0,0,0,0,0,0,0,0,3,2
2,1,1,2,2,23,3,0,0,0,0,0,0,0,11,10,2,1,1,1,61,1,2,2,1,2,2,2,1,2,1,2,1,0,2,1,4,2,3,2,3,3,3,3,2,3,2,3,2,2,1,3,4,2,3,1,3,3,3,7,3, , , , ,2,2, , , , ,9,23,2,1,3,0,2,2,1, , , , ,1,.602059991327962,2,9,-.25,0,1,3.16227766016838,1,1,0, , ,11,10,12,10,7,11,1,1,2,1,3,0,0,2,0,1,2,1,2,2,12,32,0,0,0,1,0,0,1,0,0,0,3,1
4,3,2,2,3,18,3,1,0,0,0,0,0,0,0,0,0,0,0,0,74,0,0,0,0,0,0,0,0,0,0,0,0,0,0,4,4,4,1,4,1,2,4,1,4,4,4,1,4,1,4,4,4,4,1,3,4,4,3,5,3, , , , ,2,2, , , , ,7,18,3,0,3,0,2,2,2, , , , ,1,.602059991327962,2,9,-.25,0,1,0, ,1,0, , ,15,16,4,16,16,7,2,2,2,1,3,0,0,2,0,0,1,1,2,2,10,25,0,0,1,0,0,0,1,0,0,0,3,1
2,3,2,2,4,26,3,0,1,0,1,0,0,0,14,9,2,1,1,1,65,2,0,2,1,3,3,1,1,3,1,2,1,1,2,3,3,4,2,2,3,3,3,3,3,3,2,2,3,2,1,2,3,2,3,4,3,4,2,6,3, , , , ,2,2, , , , ,10,26,3,0,3,0,2,2,2, , , , ,1,.602059991327962,2,9,-.25,0,1,3,.954242509439325,1,0, , ,12,11,11,13,9,9,2,2,2,1,3,0,0,2,0,0,1,2,2,2,15,36,0,0,0,0,0,1,1,0,0,0,3,1
1,1,3,2,4,23,3,1,0,0,0,0,0,0,14,16,2,2,1,1,62,2,2,1,2,2,3,2,3,2,2,3,2,2,2,1,4,4,3,3,3,3,1,2,2,3,3,1,3,2,3,2,3,3,3,3,3,1,3,6,2, , , , ,1,2, , , , ,10,23,0,2,3,1,1,1,3, , , , ,1,.477121254719662,1.73205080756888,4,-.333333333333333,0,0,4,1.20411998265592,1,0, , ,12,10,9,7,13,11,1,2,2,1,2,1,1,2,1,1,2,1,2,2,13,33,0,0,0,1,0,0,1,0,0,0,3,1
1,4,2,1,2,21,3,1,0,0,0,0,0,0,13,12,2,2,1,1,67,2,1,2,1,3,3,1,3,1,2,2,0,2,2,3,3,4,3,3,3,3,3,2,3,3,1,1,3,3,3,3,3,3,2,4,4,1,3,12,6, , , , ,2,2, , , , ,14,21,2,0,3,1,2,2,3, , , , ,1,.602059991327962,2,9,-.25,0,1,3.46410161513775,1.07918124604762,1,0, , ,13,13,8,10,11,12,2,2,1,1,3,0,0,2,1,0,2,1,2,2,16,35,0,0,0,0,0,0,0,0,0,0,3,1
1,1,2,2,2,24,3,2,0,1,1,0,0,0,12,7,2,0,1,0,89,0,1,2,1,3,1,0,0,2,3,2,1,3,0,4,4,4,4,4,4,4,4,2,4,4,1,4,4,4,4,4,4,4,2,4,4,4,4,3,1.5, , , , ,1,1, , , , ,6, ,1,0,3,2,2,3,3, , , , ,1,0,1,0,-1,0,0,2.64575131106459,.845098040014257,0,1, , ,16,16,12,16,13,16,1,2,2,0,0,1,3,2,1,0,2,1,2,1,7,30,0,0,1,1,0,0,1,0,0,0,3,1
1,4,2,2,3,18,3,0,0,0,0,0,0,0,3,3,0,0,0,0,86,1,0,1,0,0,0,0,1,1,0,0,0,0,2,4,4,4,4,3,4,3,4,4,4,4,4,4,4,4,4,3,1,3,4,3,3,4,3,6,4, , , , ,1,1, , , , ,7,18,0,1,3,2,1,3,3, , , , ,1,.301029995663981,1.4142135623731,1,-.5,0,0,1.73205080756888,.477121254719662,0,1, , ,14,14,16,13,15,14,2,2,2,1,1,1,2,2,1,1,2,1,2,2,8,25,0,0,0,0,0,0,1,0,0,0,3,1
1,4,1,1,2,19,3,2,1,0,0,0,0,0,15,12,2,2,1,1,65,2,2,3,0,3,3,2,1,2,1,1,3,2,2,3,2,4,3,3,3,3,4,3,3,3,3,1,4,2,2,1,3,3,2,2,3,3,2,7,6, , , , ,1,2, , , , ,13,19,1,0,3,2,2,3,3, , , , ,1,.301029995663981,1.4142135623731,1,-.5,0,0,3.46410161513775,1.07918124604762,0,1, , ,8,14,9,12,12,10,2,1,1,1,1,1,2,2,1,0,2,1,2,1,15,32,0,0,0,0,0,1,0,0,0,0,3,1
1,3,1,3,3,22,3,0,0,1,0,0,1,0,12,5,2,0,1,0,67,1,1,3,1,3,0,0,1,1,2,3,0,1,0,4,3,4,4,2,1,4,1,2,3,3,3,1,3,3,4,3,3,3,2,3,2,3,3,5,3, , , , ,2,1, , , , ,4,21,1,0,3,2,2,3,3, , , , ,1,.301029995663981,1.4142135623731,1,-.5,0,0,2.23606797749979,.698970004336019,0,1, , ,12,8,6,13,14,14,2,1,2,1,1,1,2,2,1,0,2,1,2,1,9,26,0,0,0,0,0,0,0,0,0,0,3,1
1,1,1,2,2,22,3,1,1,0,0,0,0,0,13,12,2,2,1,1,62,1,2,2,1,1,2,3,1,2,1,2,3,2,2,3,3,3,3,2,3,2,1,2,3,3,3,2,3,2,2,2,2,2,3,3,4,3,3,9,5, , , , ,1,1, , , , ,13,22,1,0,3,2,2,3,3, , , , ,1,.301029995663981,1.4142135623731,1,-.5,0,0,3.46410161513775,1.07918124604762,0,1, , ,11,10,10,11,10,10,1,1,2,1,1,1,2,1,1,0,2,1,2,2,14,35,0,0,0,0,0,0,1,0,0,0,3,1
1,1,3,1,2,24,3,2,0,0,0,0,0,0,16,14,2,2,1,1,62,2,2,3,2,1,3,2,2,3,2,3,2,2,1,3,3,4,2,2,3,2,3,3,3,2,2,2,3,3,2,3,3,3,2,2,2,2,3,6,1, , , , ,2,1, , , , ,8,24,1,0,3,2,2,3,3, , , , ,1,.477121254719662,1.73205080756888,4,-.333333333333333,0,0,3.74165738677394,1.14612803567824,1,0, , ,10,10,10,11,11,10,1,2,1,1,2,1,1,2,1,0,1,1,2,2,11,32,0,0,0,1,0,0,1,0,0,0,3,2
3,2,1,2,3,16,2,1,0,1,1,0,1,0,9,4,1,0,1,0,70,0,0,3,0,2,1,0,2,2,1,2,0,0,0,3,2,2,2,1,4,3,2,2,2,3,3,3,4,4,3,3,4,4,3,4,4,3,2,.1,0, , , , ,2,1, , , , ,6,15,1,0,3,2,2,3,3, , , , ,1,.477121254719662,1.73205080756888,4,-.333333333333333,0,0,2,.602059991327962,1,0, , ,12,11,12,12,12,11,2,1,2,1,2,1,1,2,1,0,2,2,2,2,7,22,0,0,0,0,0,0,0,0,0,0,3,1
2,7,2,2,4,19,3,0,0,0,0,0,0,0,0,1,0,0,0,0,63,0,1,0,0,0,0,0,0,0,0,0,0,0,0,2,3,3,1,3,3,2,4,3,4,2,2,4,4,2,2,2,2,2,4,2,3,2,2,9,7, , , , ,1,2, , , , ,11,19,0,0,3,3,3,3,3, , , , ,1,.301029995663981,1.4142135623731,1,-.5,0,0,1,0,0,1, , ,9,14,14,10,9,7,2,2,2,1,1,1,2,2,1,0,2,1,2,1,12,30,0,0,0,0,0,0,1,0,0,0,3,1
1,6,2,3,4,24,3,1,0,0,0,0,0,0,8,10,1,1,1,1,89,1,1,0,0,2,2,1,2,1,2,1,2,2,1,4,4,4,3,3,4,3,4,4,3,4,4,4,4,4,3,4,4,4,3,3,4,4,4,3.5,1.5, , , , ,2,1, , , , ,6, ,0,0,3,3,3,3,3, , , , ,1,.301029995663981,1.4142135623731,1,-.5,0,0,3.16227766016838,1,0,1, , ,15,15,15,15,15,14,2,2,2,1,1,1,2,2,1,0,2,1,2,1,7,30,0,0,0,1,0,0,0,0,0,0,3,1
2,3,1,2,3,20,3, ,0,0,0,0,0,0,18,6,2,0,1,0,87,1,3,3,0,3,0,3,0,3,3,2,0,3,0,4,4,4,4,4,4,3,4,4,4,3,3,4,4,4,3,3,4,4,3,2,4,3,4,3,2, , , , ,2,2, , , , ,4, ,0,0,3,3,3,3,3, , , , ,1,.477121254719662,1.73205080756888,4,-.333333333333333,0,0,2.44948974278318,.778151250383644,1,0, , ,12,16,15,15,14,15,2,1,2,1,2,1,1,2,1,0,2,1,2,1,8,24,0,0,0,0,0,0,0,0,0,0,3,1
4,4,3,2,2,22,3,0,0,0,0,0,1,0,4,4,0,0,0,0,91,0,0,0,0,1,0,0,0,0,1,3,0,0,3,4,4,4,4,2,4,4,2,4,4,4,4,4,4,4,4,4,4,4,4,4,3,4,4,4,2, , , , ,1,2, , , , ,6,22,0,0,3,3,3,3,3, , , , ,1,.477121254719662,1.73205080756888,4,-.333333333333333,0,0,2,.602059991327962,1,0, , ,16,11,16,16,16,16,2,2,2,1,2,1,1,2,1,0,2,1,2,2,8,28,0,0,0,0,0,0,0,0,0,0,3,1
2,3,2,2,1,23,3, ,0,0,0,0,0,0,4,11,0,2,0,1,91,0,2,0,3,0,0,1,0,0,1,2,2,1,3,4,4,4,1,3,4,4,4,4,4,4,4,4,4,4,4,4,4,4,4,4,4,3,4,6,2.5, , , , ,2,1, , , , ,7, ,0,0,3,3,3,3,3, , , , ,1,.477121254719662,1.73205080756888,4,-.333333333333333,0,0,3.3166247903554,1.04139268515823,1,0, , ,16,15,16,15,16,13,2,2,2,1,2,1,1,2,1,0,2,1,2,2,10,30,0,0,0,0,0,0,1,0,0,0,3,1
2,3,2,1,2,25,3,0,0,0,0,0,0,0,11,5,2,0,1,0,70,0,0,2,0,3,0,0,1,2,3,2,0,2,1,3,3,3,3,2,3,3,2,3,3,3,3,3,3,3,3,3,3,3,3,3,3,3,3,9,6, , , , ,2,1, , , , ,11,26,0,0,3,3,3,3,3, , , , ,1,.477121254719662,1.73205080756888,4,-.333333333333333,0,0,2.23606797749979,.698970004336019,1,0, , ,12,10,12,12,12,12,2,2,1,1,2,1,1,2,1,0,2,1,2,2,19,36,0,0,0,0,0,1,1,0,1,0,3,1
1,3,2,1,2,27,3,0,0,0,0,0,0,0,9,9,1,1,1,1,74,3,1,1,0,1,0,0,1,0,3,2,1,2,3,2,3,3,3,3,4,3,3,4,3,4,3,3,3,3,3,3,3,3,3,3,3,3,3,3,1, , , , ,1,2, , , , ,7,27,0,0,3,3,3,3,3, , , , ,1,.477121254719662,1.73205080756888,4,-.333333333333333,0,0,3,.954242509439325,1,0, , ,13,12,14,11,12,12,2,2,1,1,2,1,1,2,1,0,2,2,2,2,17,34,0,0,1,0,0,0,1,0,0,0,3,1
1,2,2,2,4,19,2,1,0,0,1,0,0,0,4,4,0,0,0,0,68,0,0,0,0,1,0,0,1,2,0,0,0,1,3,3,2,3,2,2,3,3,2,3,3,3,3,3,3,3,3,3,3,3,3,3,3,3,3,0,6.5, , , , ,2,2, , , , ,13,19,0,0,3,3,3,3,3, , , , ,1,.477121254719662,1.73205080756888,4,-.333333333333333,0,0,2,.602059991327962,1,0, , ,11,10,12,12,12,11,2,2,2,1,2,1,1,1,1,0,2,2,2,1,14,32,0,0,1,0,0,0,1,0,0,0,3,1
1,2,2,2,4,23,3,1,0,0,0,0,0,0,6,11,0,2,0,1,84,0,3,2,3,1,0,0,1,0,3,1,0,2,1,1,4,1,4,4,4,4,4,4,4,4,4,4,4,4,4,4,4,4,4,1,1,4,4,4,3, , , , ,2,1, , , , ,7, ,0,0,3,3,3,3,3, , , , ,1,.477121254719662,1.73205080756888,4,-.333333333333333,0,0,3.3166247903554,1.04139268515823,1,0, , ,13,13,16,13,13,16,2,2,2,1,2,1,1,1,1,0,2,1,2,2,10,30,0,0,1,0,0,0,1,0,0,0,3,1
1,4,1,2,4,21,3,0,0,0,0,0,0,0,9,9,1,1,1,1,85,0,2,2,0,2,2,0,2,1,2,2,0,2,1,4,2,3,4,3,4,3,3,2,4,3,3,4,4,4,4,3,4,4,4,4,4,4,4,12,5, , , , ,2,2, , , , ,14,21,0,0,3,3,3,3,3, , , , ,1,.602059991327962,2,9,-.25,0,1,3,.954242509439325,1,0, , ,12,14,14,16,14,15,2,1,2,1,3,0,0,2,1,0,2,1,2,2,16,35,0,0,0,0,0,0,0,0,0,0,3,1
1,3,2,1,3,23,3,0,0,0,0,0,0,0,7,7,0,0,0,0,71,0,3,2,0,2,0,1,2,0,2,1,0,1,0,3,3,3,3,3,3,3,3,3,3,3,3,3,3,3,3,3,3,2,3,3,3,3,3,4,2, , , , ,2,2, , , , ,5,23,0,0,3,3,3,3,3, , , , ,1,.602059991327962,2,9,-.25,0,1,2.64575131106459,.845098040014257,1,0, , ,12,12,12,12,11,12,2,2,1,1,3,0,0,2,1,0,2,1,2,2,11,28,0,0,0,1,0,0,1,0,0,0,3,1
1,4,1,2,3,22,2,0,0,1,0,0,0,0,2,0,0,0,0,0,68,0,0,0,0,0,0,0,0,0,0,2,0,0,0,3,2,3,2,2,4,3,2,3,3,3,3,3,3,3,3,3,3,3,3,3,2,3,3,1, , , , , ,1, , , , , ,3,19,2,0,2,0,2,2, , , , , ,1,0,1,0,-1,0,0,0, ,0,1, , ,11,9,13,12,12,11,2,1,2,0,0,1,2,2,0,0,2,1,2,1,6,25,0,0,0,0,0,0,1,0,0,0,2,1
1,4,2,2,3,22,2,0,0,0,0,0,0,0,3,0,0,0,0,0,76,0,0,1,0,0,0,0,0,0,0,2,0,0,0,3,3,3,3,3,4,4,3,3,4,3,3,3,3,3,3,3,3,3,3,4,3,3,3,4, , , , , ,1, , , , , ,6,22,2,0,2,0,2,2, , , , , ,1,0,1,0,-1,0,0,0, ,0,1, , ,13,12,13,13,12,13,2,2,2,0,0,1,2,2,0,0,1,1,2,1,8,28,0,0,0,0,0,0,1,0,0,0,2,1
1,1,3,2,2,18,2,0,1,1,0,0,0,0,16,15,2,2,1,1,62,1,2,3,2,3,1,3,3,3,3,0,3,3,1,1,4,2,3,1,3,3,2,3,1,3,3,3,2,3,4,4,3,3,3,2,2,2,2,1, , , , , ,1, , , , , ,2,18,2,0,2,0,2,2, , , , , ,1,0,1,0,-1,0,0,3.87298334620742,1.17609125905568,0,1, , ,13,7,12,7,12,11,1,2,2,0,0,1,2,1,0,0,2,1,2,1,5,20,0,1,0,0,0,0,0,0,0,0,2,1
3,2,3,2,2,20,2, ,0,0,0,0,0,0,10,5,1,0,1,0,82,1,2,2,0,2,0,1,1,1,2,1,0,2,0,3,4,3,3,4,4,3,4,4,4,3,4,3,4,3,3,3,4,4,3,3,3,3,3,2, , , , , ,1, , , , , ,4, ,2,0,2,0,2,2, , , , , ,1,.301029995663981,1.4142135623731,1,-.5,0,0,2.23606797749979,.698970004336019,0,0, , ,13,15,14,14,14,12,2,2,2,1,1,1,1,2,0,0,2,1,2,2,5,24,0,0,0,0,0,0,0,0,0,0,2,1
4,1,2,1,2,20,2,1,0,1,0,1,0,0,12,9,2,1,1,1,92,1,2,1,0,2,2,3,2,1,2,2,1,2,0,4,4,4,3,4,4,4,4,4,4,4,4,4,4,4,4,3,4,4,3,3,4,4,4,2, , , , , ,1, , , , , ,4, ,2,0,2,0,2,2, , , , , ,1,.301029995663981,1.4142135623731,1,-.5,0,0,3,.954242509439325,0,0, , ,14,16,15,16,16,15,1,2,1,1,1,1,1,2,0,0,2,1,2,2,5,24,0,0,1,0,0,1,1,0,0,0,2,1
3,2,3,2,3,20,2, ,0,0,0,0,0,0,10,9,1,1,1,1,89,1,1,2,2,1,1,1,1,2,2,1,1,2,1,4,4,4,3,4,4,3,4,4,4,3,4,3,4,3,3,4,4,4,3,4,4,4,4,4, , , , , ,1, , , , , ,6, ,2,0,2,0,2,2, , , , , ,1,.301029995663981,1.4142135623731,1,-.5,0,0,3,.954242509439325,0,0, , ,15,16,14,16,15,13,2,2,2,1,1,1,1,2,0,0,2,1,2,2,7,26,0,0,0,0,0,0,1,0,0,0,2,1
1,4,2,1,3,22,2,0,1,0,0,0,0,0,5,6,0,0,0,0,68,1,2,0,1,1,0,0,0,0,3,3,0,0,0,3,2,3,3,3,3,3,3,3,3,3,3,3,2,3,3,3,3,3,3,2,2,3,3,6, , , , , ,2, , , , , ,8,21,2,0,2,0,2,2, , , , , ,1,.301029995663981,1.4142135623731,1,-.5,0,0,2.44948974278318,.778151250383644,0,0, , ,10,10,12,12,12,12,2,2,1,1,1,1,1,2,0,0,2,2,2,1,9,30,0,0,0,0,0,0,1,0,0,0,2,1
1,5,2,2,2,23,1,0,1,0,1,0,0,0,13,1,2,0,1,0,59,0,0,3,0,2,1,3,0,0,0,3,0,2,0,3,4,4,3,3,1,3,3,2,1,4,1,1,2,3,1,1,2,2,4,4,2,3,2,2, , , , , ,1, , , , , ,5,22,2,0,2,0,2,2, , , , , ,1,.301029995663981,1.4142135623731,1,-.5,0,0,1,0,0,0, , ,13,10,8,9,8,11,2,2,2,1,1,1,1,2,0,0,2,1,2,2,7,28,0,0,1,0,0,0,0,0,0,0,2,1